{"text_format":"1","workbook":"xlsx","n_sheets":6,"sheets":["Inicio","Siniestros Denunciados","Siniestros Liquidación directa","Denunciados Periodos Anteriores","20 Liq con mayor asignación","Base"],"not_rendered":{"charts":0,"images":5,"macros":1,"external_links":0,"defined_names":2,"comments":0,"pivot_tables":0},"unopened":[],"bounds":{"document_bytes":16777216,"sheet_cells":100000,"rows_first":2000,"rows_last":500,"rows_between":2000,"halvings":0,"cell_chars":16384,"cell_head_chars":4096},"cells_cut":0,"cells_raw":0,"read":"row_number_cap","date_system":"1900"}

{"sheet":"Inicio","index":0,"n_rows":10,"n_cols":4,"rows_kept":10,"cut":false,"hidden":false,"merged":[[3,1,3,2],[5,1,5,2],[7,1,7,2],[9,1,9,2]]}
[]
["Información Agregada Compañias de Seguros"]
[]
["Grupo compañía:",1]
[]
["Nombre Compañía:",null,null,"Buscar Entidad"]
[]
["Rut:",{"$f":"IFERROR(VLOOKUP(B6,Base!$K:$L,2,0),\"\")","v":""}]
[]
["Periodo","2025-06"]

{"sheet":"Siniestros Denunciados","index":1,"n_rows":71,"n_cols":19,"rows_kept":71,"cut":false,"hidden":false,"merged":[[0,0,1,3]],"read":"row_number_cap"}
["Siniestros Denunciados",null,null,null,"Grupo compañía:",{"$f":"Inicio!B4","v":1},{"$f":"+VLOOKUP(F1,Base!$C$2:$D$3,2,0)","v":"General"},null,{"$f":"+SUM(D8:D87)","v":0},null,{"$f":"+MAX(Base!P2:P90)","v":0}]
[null,null,null,null,"Periodo",{"$f":"Inicio!B10","v":"2025-06"}]
[]
[]
[]
[]
["Ramo","N° Siniestros Denunciados","N° Siniestros Liquidados","Liquidación Directa","Con Liquidador","Con Indemnización","Sin Indemnización","Plazo Promedio","Monto Efectivo de Pago",null,null,"MinD","MaxD","MinE","MaxE","MinF","MaxF","MinG","MaxG"]
[null,null,null,null,null,null,null,null,null,null,null,{"$f":"IF(LEN(E8)=0,0,C8-E8)","v":0},{"$f":"IF(LEN(E8)=0,C8,C8-E8)","v":0},{"$f":"IF(LEN(D8)=0,0,C8-D8)","v":0},{"$f":"IF(LEN(D8)=0,C8,C8-D8)","v":0},{"$f":"IF(LEN(G8)=0,0,C8-G8)","v":0},{"$f":"IF(LEN(G8)=0,C8,C8-G8)","v":0},{"$f":"IF(LEN(F8)=0,0,C8-F8)","v":0},{"$f":"IF(LEN(F8)=0,C8,C8-F8)","v":0}]
[null,null,null,null,null,null,null,null,null,null,null,{"$f":"IF(LEN(E9)=0,0,C9-E9)","v":0},{"$f":"IF(LEN(E9)=0,C9,C9-E9)","v":0},{"$f":"IF(LEN(D9)=0,0,C9-D9)","v":0},{"$f":"IF(LEN(D9)=0,C9,C9-D9)","v":0},{"$f":"IF(LEN(I9)=0,0,G9-I9)","v":0},{"$f":"IF(LEN(G9)=0,C9,C9-G9)","v":0},{"$f":"IF(LEN(F9)=0,0,C9-F9)","v":0},{"$f":"IF(LEN(F9)=0,C9,C9-F9)","v":0}]
[null,null,null,null,null,null,null,null,null,null,null,0,0,0,0,0,0,0,0]
[null,null,null,null,null,null,null,null,null,null,null,0,0,0,0,0,0,0,0]
[null,null,null,null,null,null,null,null,null,null,null,0,0,0,0,0,0,0,0]
[null,null,null,null,null,null,null,null,null,null,null,0,0,0,0,0,0,0,0]
[null,null,null,null,null,null,null,null,null,null,null,0,0,0,0,0,0,0,0]
[null,null,null,null,null,null,null,null,null,null,null,0,0,0,0,0,0,0,0]
[null,null,null,null,null,null,null,null,null,null,null,0,0,0,0,0,0,0,0]
[null,null,null,null,null,null,null,null,null,null,null,0,0,0,0,0,0,0,0]
[null,null,null,null,null,null,null,null,null,null,null,0,0,0,0,0,0,0,0]
[null,null,null,null,null,null,null,null,null,null,null,0,0,0,0,0,0,0,0]
[null,null,null,null,null,null,null,null,null,null,null,0,0,0,0,0,0,0,0]
{"$rows_left_out":52}
{"sheet":"Siniestros Liquidación directa","index":2,"n_rows":70,"n_cols":25,"rows_kept":70,"cut":false,"hidden":false,"merged":[[6,9,6,12],[3,0,3,10],[0,0,1,6],[4,0,4,10]]}
["Siniestros Denunciados y liqudados (Liquidación Directa)",null,null,null,null,null,null,"Grupo compañía:",{"$f":"Inicio!B4","v":1},{"$f":"+VLOOKUP(I1,Base!$C$2:$D$3,2,0)","v":"General"},{"$f":"+MAX(Base!Q2:Q90)","v":0},null,{"$f":"'Siniestros Denunciados'!I1","v":0}]
[null,null,null,null,null,null,null,"Periodo",{"$f":"Inicio!B10","v":"2025-06"}]
[]
[{"$f":"+IF('Siniestros Denunciados'!$I$1=0,\"En la pestaña Siniestros Denunciados, usted indica que no tiene Siniestros liquidados directamente, en caso de existir un error favor revisar\",\"\")","v":"En la pestaña Siniestros Denunciados, usted indica que no tiene Siniestros liquidados directamente, en caso de existir un error favor revisar"}]
[{"$f":"+IF(SUM(C9:C65)-M1>0,\"Ha ingresado mayor número de Siniestros Liquidados directamente que en la pestaña anterior\",IF(SUM(C9:C65)-M1<0,\"Aún no ha ingresado todos los siniestros liquidados directamente que ha ingresado en la pestaña anterior\",IF(SUM(C9:C65)-M1=0,\"\")))","v":""}]
[]
[null,null,null,null,null,null,null,null,null,"Motivo Rechazo"]
["Ramo","N° Siniestros Asignados","N° Siniestros Liquidados","Con Pago","Plazo Promedio con Pago","Sin Pago","Plazo Promedio sin Pago","Monto Promedio","Monto Efectivo de Pago Liquidacion directa","1.- Sin Cobertura","2.- Bajo deducible","3.- Incumplimiento de contrato por parte del asegurado","4.- Otros","Detalle Otros","Validador",null,null,"MinD","MaxD","MinE","MaxE","MaxJ","MaxK","MaxL","ValorM"]
[null,null,null,null,null,null,null,null,null,null,null,null,null,null,{"$f":"IF(F9=\"\",\"\",IF(SUM(J9:M9)=F9,\"Suma motivo de Pago correcto\",\"Existe un error en la suma de Motivo de Pago\"))","v":""},{"$f":"IFERROR(VLOOKUP(A9,'Siniestros Denunciados'!$A$8:$D$70,2,0),\"\")","v":""},{"$f":"IFERROR(VLOOKUP(A9,'Siniestros Denunciados'!$A$8:$D$70,4,0),\"\")","v":""},{"$f":"IF(LEN(F9)=0,0,C9-F9)","v":0},{"$f":"IF(LEN(F9)=0,C9,C9-F9)","v":0},{"$f":"IF(LEN(D9)=0,0,C9-D9)","v":0},{"$f":"IF(LEN(D9)=0,C9,C9-D9)","v":0},{"$f":"IF(AND(LEN(K9)=0,LEN(L9)=0,LEN(M9)=0),F9,F9-K9-L9-M9)","v":0},{"$f":"IF(AND(LEN(J9)=0,LEN(L9)=0,LEN(M9)=0),F9,F9-J9-L9-M9)","v":0},{"$f":"IF(AND(LEN(J9)=0,LEN(K9)=0,LEN(M9)=0),F9,F9-J9-K9-M9)","v":0},{"$f":"IF(AND(LEN(J9)=0,LEN(K9)=0,LEN(L9)=0),F9,F9-J9-K9-L9)","v":0}]
[null,null,null,null,null,null,null,null,null,null,null,null,null,null,{"$f":"IF(F10=\"\",\"\",IF(SUM(J10:M10)=F10,\"Suma motivo de Pago correcto\",\"Existe un error en la suma de Motivo de Pago\"))","v":""},{"$f":"IFERROR(VLOOKUP(A10,'Siniestros Denunciados'!$A$8:$D$70,2,0),\"\")","v":""},{"$f":"IFERROR(VLOOKUP(A10,'Siniestros Denunciados'!$A$8:$D$70,4,0),\"\")","v":""},{"$f":"IF(LEN(F10)=0,0,C10-F10)","v":0},{"$f":"IF(LEN(F10)=0,C10,C10-F10)","v":0},{"$f":"IF(LEN(D10)=0,0,C10-D10)","v":0},{"$f":"IF(LEN(D10)=0,C10,C10-D10)","v":0},{"$f":"IF(AND(LEN(K10)=0,LEN(L10)=0,LEN(M10)=0),F10,F10-K10-L10-M10)","v":0},{"$f":"IF(AND(LEN(J10)=0,LEN(L10)=0,LEN(M10)=0),F10,F10-J10-L10-M10)","v":0},{"$f":"IF(AND(LEN(J10)=0,LEN(K10)=0,LEN(M10)=0),F10,F10-J10-K10-M10)","v":0},{"$f":"IF(AND(LEN(J10)=0,LEN(K10)=0,LEN(L10)=0),F10,F10-J10-K10-L10)","v":0}]
[null,null,null,null,null,null,null,null,null,null,null,null,null,null,"",{"$f":"IFERROR(VLOOKUP(A11,'Siniestros Denunciados'!$A$8:$D$70,2,0),\"\")","v":""},{"$f":"IFERROR(VLOOKUP(A11,'Siniestros Denunciados'!$A$8:$D$70,4,0),\"\")","v":""},0,0,0,0,0,0,0,0]
[null,null,null,null,null,null,null,null,null,null,null,null,null,null,"",{"$f":"IFERROR(VLOOKUP(A12,'Siniestros Denunciados'!$A$8:$D$70,2,0),\"\")","v":""},{"$f":"IFERROR(VLOOKUP(A12,'Siniestros Denunciados'!$A$8:$D$70,4,0),\"\")","v":""},0,0,0,0,0,0,0,0]
[null,null,null,null,null,null,null,null,null,null,null,null,null,null,"",{"$f":"IFERROR(VLOOKUP(A13,'Siniestros Denunciados'!$A$8:$D$70,2,0),\"\")","v":""},{"$f":"IFERROR(VLOOKUP(A13,'Siniestros Denunciados'!$A$8:$D$70,4,0),\"\")","v":""},0,0,0,0,0,0,0,0]
[null,null,null,null,null,null,null,null,null,null,null,null,null,null,"",{"$f":"IFERROR(VLOOKUP(A14,'Siniestros Denunciados'!$A$8:$D$70,2,0),\"\")","v":""},{"$f":"IFERROR(VLOOKUP(A14,'Siniestros Denunciados'!$A$8:$D$70,4,0),\"\")","v":""},0,0,0,0,0,0,0,0]
[null,null,null,null,null,null,null,null,null,null,null,null,null,null,"",{"$f":"IFERROR(VLOOKUP(A15,'Siniestros Denunciados'!$A$8:$D$70,2,0),\"\")","v":""},{"$f":"IFERROR(VLOOKUP(A15,'Siniestros Denunciados'!$A$8:$D$70,4,0),\"\")","v":""},0,0,0,0,0,0,0,0]
[null,null,null,null,null,null,null,null,null,null,null,null,null,null,"",{"$f":"IFERROR(VLOOKUP(A16,'Siniestros Denunciados'!$A$8:$D$70,2,0),\"\")","v":""},{"$f":"IFERROR(VLOOKUP(A16,'Siniestros Denunciados'!$A$8:$D$70,4,0),\"\")","v":""},0,0,0,0,0,0,0,0]
[null,null,null,null,null,null,null,null,null,null,null,null,null,null,"",{"$f":"IFERROR(VLOOKUP(A17,'Siniestros Denunciados'!$A$8:$D$70,2,0),\"\")","v":""},{"$f":"IFERROR(VLOOKUP(A17,'Siniestros Denunciados'!$A$8:$D$70,4,0),\"\")","v":""},0,0,0,0,0,0,0,0]
[null,null,null,null,null,null,null,null,null,null,null,null,null,null,"",{"$f":"IFERROR(VLOOKUP(A18,'Siniestros Denunciados'!$A$8:$D$70,2,0),\"\")","v":""},{"$f":"IFERROR(VLOOKUP(A18,'Siniestros Denunciados'!$A$8:$D$70,4,0),\"\")","v":""},0,0,0,0,0,0,0,0]
[null,null,null,null,null,null,null,null,null,null,null,null,null,null,"",{"$f":"IFERROR(VLOOKUP(A19,'Siniestros Denunciados'!$A$8:$D$70,2,0),\"\")","v":""},{"$f":"IFERROR(VLOOKUP(A19,'Siniestros Denunciados'!$A$8:$D$70,4,0),\"\")","v":""},0,0,0,0,0,0,0,0]
[null,null,null,null,null,null,null,null,null,null,null,null,null,null,"",{"$f":"IFERROR(VLOOKUP(A20,'Siniestros Denunciados'!$A$8:$D$70,2,0),\"\")","v":""},{"$f":"IFERROR(VLOOKUP(A20,'Siniestros Denunciados'!$A$8:$D$70,4,0),\"\")","v":""},0,0,0,0,0,0,0,0]
{"$rows_left_out":51}
{"sheet":"Denunciados Periodos Anteriores","index":3,"n_rows":70,"n_cols":25,"rows_kept":70,"cut":false,"hidden":false,"merged":[[0,0,1,6],[3,0,3,10],[4,0,4,10],[6,9,6,12]]}
["Siniestros Denunciados Periodos Anteriores",null,null,null,null,null,null,"Grupo compañía:",{"$f":"Inicio!B4","v":1},{"$f":"+VLOOKUP(I1,Base!$C$2:$D$3,2,0)","v":"General"},{"$f":"+MAX(Base!R2:R90)","v":0}]
[null,null,null,null,null,null,null,"Periodo",{"$f":"Inicio!B10","v":"2025-06"}]
[]
[]
[]
[]
[null,null,null,null,null,null,null,null,null,"Motivo Rechazo"]
["Ramo","N° Siniestros Asignados","N° Siniestros Liquidados","Con Pago","Plazo Promedio con Pago","Sin Pago","Plazo Promedio sin Pago","Monto Promedio","Monto Efectivo de Pago Liquidacion directa","1.- Sin Cobertura","2.- Bajo deducible","3.- Incumplimiento de contrato por parte del asegurado","4.- Otros","Detalle Otros","Validador",null,null,"MinD","MaxD","MinE","MaxE","MaxJ","MaxK","MaxL","ValorM"]
[null,null,null,null,null,null,null,null,null,null,null,null,null,null,{"$f":"IF(F9=\"\",\"\",IF(SUM(J9:M9)=F9,\"Suma motivo de Pago correcto\",\"Existe un error en la suma de Motivo de Pago\"))","v":""},null,null,{"$f":"IF(LEN(F9)=0,0,C9-F9)","v":0},{"$f":"IF(LEN(F9)=0,C9,C9-F9)","v":0},{"$f":"IF(LEN(D9)=0,0,C9-D9)","v":0},{"$f":"IF(LEN(D9)=0,C9,C9-D9)","v":0},{"$f":"IF(AND(LEN(K9)=0,LEN(L9)=0,LEN(M9)=0),F9,F9-K9-L9-M9)","v":0},{"$f":"IF(AND(LEN(J9)=0,LEN(L9)=0,LEN(M9)=0),F9,F9-J9-L9-M9)","v":0},{"$f":"IF(AND(LEN(J9)=0,LEN(K9)=0,LEN(M9)=0),F9,F9-J9-K9-M9)","v":0},{"$f":"IF(AND(LEN(J9)=0,LEN(K9)=0,LEN(L9)=0),F9,F9-J9-K9-L9)","v":0}]
[null,null,null,null,null,null,null,null,null,null,null,null,null,null,{"$f":"IF(F10=\"\",\"\",IF(SUM(J10:M10)=F10,\"Suma motivo de Pago correcto\",\"Existe un error en la suma de Motivo de Pago\"))","v":""},null,null,{"$f":"IF(LEN(F10)=0,0,C10-F10)","v":0},{"$f":"IF(LEN(F10)=0,C10,C10-F10)","v":0},{"$f":"IF(LEN(D10)=0,0,C10-D10)","v":0},{"$f":"IF(LEN(D10)=0,C10,C10-D10)","v":0},{"$f":"IF(AND(LEN(K10)=0,LEN(L10)=0,LEN(M10)=0),F10,F10-K10-L10-M10)","v":0},{"$f":"IF(AND(LEN(J10)=0,LEN(L10)=0,LEN(M10)=0),F10,F10-J10-L10-M10)","v":0},{"$f":"IF(AND(LEN(J10)=0,LEN(K10)=0,LEN(M10)=0),F10,F10-J10-K10-M10)","v":0},{"$f":"IF(AND(LEN(J10)=0,LEN(K10)=0,LEN(L10)=0),F10,F10-J10-K10-L10)","v":0}]
[null,null,null,null,null,null,null,null,null,null,null,null,null,null,"",null,null,0,0,0,0,0,0,0,0]
[null,null,null,null,null,null,null,null,null,null,null,null,null,null,"",null,null,0,0,0,0,0,0,0,0]
[null,null,null,null,null,null,null,null,null,null,null,null,null,null,"",null,null,0,0,0,0,0,0,0,0]
[null,null,null,null,null,null,null,null,null,null,null,null,null,null,"",null,null,0,0,0,0,0,0,0,0]
[null,null,null,null,null,null,null,null,null,null,null,null,null,null,"",null,null,0,0,0,0,0,0,0,0]
[null,null,null,null,null,null,null,null,null,null,null,null,null,null,"",null,null,0,0,0,0,0,0,0,0]
[null,null,null,null,null,null,null,null,null,null,null,null,null,null,"",null,null,0,0,0,0,0,0,0,0]
[null,null,null,null,null,null,null,null,null,null,null,null,null,null,"",null,null,0,0,0,0,0,0,0,0]
[null,null,null,null,null,null,null,null,null,null,null,null,null,null,"",null,null,0,0,0,0,0,0,0,0]
[null,null,null,null,null,null,null,null,null,null,null,null,null,null,"",null,null,0,0,0,0,0,0,0,0]
{"$rows_left_out":51}
{"sheet":"20 Liq con mayor asignación","index":4,"n_rows":28,"n_cols":10,"rows_kept":28,"cut":false,"hidden":false,"merged":[[0,0,1,4],[27,0,27,2]]}
["20 Liquidadores con mayor asignación",null,null,null,null,null,null,null,null,false]
[null,null,null,null,null,null,null,null,null,false]
[]
[]
[]
[]
["N°","Rut Liquidador","Nombre Liquidador","N° Casos",null,"Suma N° Casos",{"$f":"+IF(J1=TRUE,SUM(D8:D27),IF(J2=TRUE,0,IF(AND(J2=FALSE,J1=FALSE),SUM(D8:D28),SUM(D8:D28))))","v":0}]
[1]
[2]
[3]
[4]
[5]
[6]
[7]
[8]
[9]
[10]
[11]
[12]
[13]
{"$rows_left_out":9}
{"sheet":"Base","index":5,"n_rows":90,"n_cols":18,"rows_kept":90,"cut":false,"hidden":true,"merged":[]}
["Periodo",null,"Grupo compañía","Grupo",null,1,"General","1.-Incendio",null,null,"Grupo compañía 1","Rut Grupo 1",null,null,null,"Siniestros Denunciados","Siniestros Liquidación directa","Denunciados Periodos Anteriores"]
["2020-06",null,1,"General",null,1,"General","2.-Pérdida de beneficio por incendio",null,1,"ASEGURADORA PORVENIR S.A.","76598625-7",null,null,"1.-Incendio",{"$f":"+COUNTIF('Siniestros Denunciados'!$A$8:$A$70,Base!O2)","v":0},{"$f":"+COUNTIF('Siniestros Liquidación directa'!$A$9:$A$72,Base!O2)","v":0},{"$f":"+COUNTIF('Denunciados Periodos Anteriores'!$A$9:$A$70,Base!O2)","v":0}]
["2020-12",null,2,"Vida",null,1,"General","3.-Otros Riesgos adicionales a incendio",null,1,"ASSURANT CHILE COMPAÑIA DE SEGUROS GENERALES S.A.","76212519-6",null,null,"2.-Pérdida de beneficio por incendio",{"$f":"+COUNTIF('Siniestros Denunciados'!$A$8:$A$70,Base!O3)","v":0},{"$f":"+COUNTIF('Siniestros Liquidación directa'!$A$9:$A$72,Base!O3)","v":0},{"$f":"+COUNTIF('Denunciados Periodos Anteriores'!$A$9:$A$70,Base!O3)","v":0}]
["2021-06",null,null,null,null,1,"General","4.-Terremoto y Tsunami",null,1,"BCI SEGUROS GENERALES S.A.","99147000-K",null,null,"3.-Otros Riesgos adicionales a incendio",{"$f":"+COUNTIF('Siniestros Denunciados'!$A$8:$A$70,Base!O4)","v":0},{"$f":"+COUNTIF('Siniestros Liquidación directa'!$A$9:$A$72,Base!O4)","v":0},{"$f":"+COUNTIF('Denunciados Periodos Anteriores'!$A$9:$A$70,Base!O4)","v":0}]
["2021-12",null,null,null,null,1,"General","5.-Pérdida de beneficio por Terremoto",null,1,"BNP PARIBAS CARDIF SEGUROS GENERALES S.A.","96837640-3",null,null,"4.-Terremoto y Tsunami",{"$f":"+COUNTIF('Siniestros Denunciados'!$A$8:$A$70,Base!O5)","v":0},{"$f":"+COUNTIF('Siniestros Liquidación directa'!$A$9:$A$72,Base!O5)","v":0},{"$f":"+COUNTIF('Denunciados Periodos Anteriores'!$A$9:$A$70,Base!O5)","v":0}]
["2022-06",null,null,null,null,1,"General","6.-Otros Riesgos de la naturaleza",null,1,"CHUBB SEGUROS CHILE S.A.","99225000-3",null,null,"5.-Pérdida de beneficio por Terremoto",{"$f":"+COUNTIF('Siniestros Denunciados'!$A$8:$A$70,Base!O6)","v":0},{"$f":"+COUNTIF('Siniestros Liquidación directa'!$A$9:$A$72,Base!O6)","v":0},{"$f":"+COUNTIF('Denunciados Periodos Anteriores'!$A$9:$A$70,Base!O6)","v":0}]
["2022-12",null,null,null,null,1,"General","7.-Terrorismo",null,1,"COMPAÑIA DE SEGUROS GENERALES CONSORCIO NACIONAL DE SEGUROS S.A.","96654180-6",null,null,"6.-Otros Riesgos de la naturaleza",{"$f":"+COUNTIF('Siniestros Denunciados'!$A$8:$A$70,Base!O7)","v":0},{"$f":"+COUNTIF('Siniestros Liquidación directa'!$A$9:$A$72,Base!O7)","v":0},{"$f":"+COUNTIF('Denunciados Periodos Anteriores'!$A$9:$A$70,Base!O7)","v":0}]
["2023-06",null,null,null,null,1,"General","8.-Robo",null,1,"COMPAÑIA DE SEGUROS GENERALES CONTINENTAL S.A.","76039758-K",null,null,"7.-Terrorismo",{"$f":"+COUNTIF('Siniestros Denunciados'!$A$8:$A$70,Base!O8)","v":0},{"$f":"+COUNTIF('Siniestros Liquidación directa'!$A$9:$A$72,Base!O8)","v":0},{"$f":"+COUNTIF('Denunciados Periodos Anteriores'!$A$9:$A$70,Base!O8)","v":0}]
["2023-12",null,null,null,null,1,"General","9.-Cristales",null,1,"CONTEMPORA COMPAÑIA DE SEGUROS GENERALES S.A.","76981875-8",null,null,"8.-Robo",{"$f":"+COUNTIF('Siniestros Denunciados'!$A$8:$A$70,Base!O9)","v":0},{"$f":"+COUNTIF('Siniestros Liquidación directa'!$A$9:$A$72,Base!O9)","v":0},{"$f":"+COUNTIF('Denunciados Periodos Anteriores'!$A$9:$A$70,Base!O9)","v":0}]
["2024-06",null,null,null,null,1,"General","10.-Daños físicos Vehículos Motorizados",null,1,"EVEREST COMPAÑIA DE SEGUROS GENERALES CHILE S.A.","77591207-3",null,null,"9.-Cristales",{"$f":"+COUNTIF('Siniestros Denunciados'!$A$8:$A$70,Base!O10)","v":0},{"$f":"+COUNTIF('Siniestros Liquidación directa'!$A$9:$A$72,Base!O10)","v":0},{"$f":"+COUNTIF('Denunciados Periodos Anteriores'!$A$9:$A$70,Base!O10)","v":0}]
["2024-12",null,null,null,null,1,"General","11.-Casco Marítimo",null,1,"FID CHILE SEGUROS GENERALES S.A.","77096952-2",null,null,"10.-Daños físicos Vehículos Motorizados",{"$f":"+COUNTIF('Siniestros Denunciados'!$A$8:$A$70,Base!O11)","v":0},{"$f":"+COUNTIF('Siniestros Liquidación directa'!$A$9:$A$72,Base!O11)","v":0},{"$f":"+COUNTIF('Denunciados Periodos Anteriores'!$A$9:$A$70,Base!O11)","v":0}]
["2025-06",null,null,null,null,1,"General","12.-Casco Aéreo",null,1,"HDI SEGUROS S.A.","99061000-2",null,null,"11.-Casco Marítimo",{"$f":"+COUNTIF('Siniestros Denunciados'!$A$8:$A$70,Base!O12)","v":0},{"$f":"+COUNTIF('Siniestros Liquidación directa'!$A$9:$A$72,Base!O12)","v":0},{"$f":"+COUNTIF('Denunciados Periodos Anteriores'!$A$9:$A$70,Base!O12)","v":0}]
["2025-12",null,null,null,null,1,"General","13.-Responsabilidad civil Hogar y Condominios",null,1,"MAPFRE COMPAÑIA DE SEGUROS GENERALES DE CHILE S.A.","96508210-7",null,null,"12.-Casco Aéreo",{"$f":"+COUNTIF('Siniestros Denunciados'!$A$8:$A$70,Base!O13)","v":0},{"$f":"+COUNTIF('Siniestros Liquidación directa'!$A$9:$A$72,Base!O13)","v":0},{"$f":"+COUNTIF('Denunciados Periodos Anteriores'!$A$9:$A$70,Base!O13)","v":0}]
[null,null,null,null,null,1,"General","14.-Responsabilidad civil Profesional",null,1,"METLIFE CHILE SEGUROS GENERALES S.A.","76328793-9",null,null,"13.-Responsabilidad civil Hogar y Condominios",{"$f":"+COUNTIF('Siniestros Denunciados'!$A$8:$A$70,Base!O14)","v":0},{"$f":"+COUNTIF('Siniestros Liquidación directa'!$A$9:$A$72,Base!O14)","v":0},{"$f":"+COUNTIF('Denunciados Periodos Anteriores'!$A$9:$A$70,Base!O14)","v":0}]
["Tipo","Grupo",null,null,null,1,"General","15.-Responsabilidad civil Industria, Infraestructura y Comercio",null,1,"MUTUALIDAD DE CARABINEROS","99024000-0",null,null,"14.-Responsabilidad civil Profesional",{"$f":"+COUNTIF('Siniestros Denunciados'!$A$8:$A$70,Base!O15)","v":0},{"$f":"+COUNTIF('Siniestros Liquidación directa'!$A$9:$A$72,Base!O15)","v":0},{"$f":"+COUNTIF('Denunciados Periodos Anteriores'!$A$9:$A$70,Base!O15)","v":0}]
["CSG",1,null,null,null,1,"General","16.-Responsabilidad civil Vehículos Motorizados",null,1,"ORION SEGUROS GENERALES S.A.","76042965-1",null,null,"15.-Responsabilidad civil Industria, Infraestructura y Comercio",{"$f":"+COUNTIF('Siniestros Denunciados'!$A$8:$A$70,Base!O16)","v":0},{"$f":"+COUNTIF('Siniestros Liquidación directa'!$A$9:$A$72,Base!O16)","v":0},{"$f":"+COUNTIF('Denunciados Periodos Anteriores'!$A$9:$A$70,Base!O16)","v":0}]
["CSC",1,null,null,null,1,"General","17.-Transporte terrestre",null,1,"REALE CHILE SEGUROS GENERALES S.A.","76743492-8",null,null,"16.-Responsabilidad civil Vehículos Motorizados",{"$f":"+COUNTIF('Siniestros Denunciados'!$A$8:$A$70,Base!O17)","v":0},{"$f":"+COUNTIF('Siniestros Liquidación directa'!$A$9:$A$72,Base!O17)","v":0},{"$f":"+COUNTIF('Denunciados Periodos Anteriores'!$A$9:$A$70,Base!O17)","v":0}]
["CSV",2,null,null,null,1,"General","18.-Transporte Marítimo",null,1,"RENTA NACIONAL COMPAÑIA DE SEGUROS GENERALES S.A.","94510000-1",null,null,"17.-Transporte terrestre",{"$f":"+COUNTIF('Siniestros Denunciados'!$A$8:$A$70,Base!O18)","v":0},{"$f":"+COUNTIF('Siniestros Liquidación directa'!$A$9:$A$72,Base!O18)","v":0},{"$f":"+COUNTIF('Denunciados Periodos Anteriores'!$A$9:$A$70,Base!O18)","v":0}]
[null,null,null,null,null,1,"General","19.-Transporte Aéreo",null,1,"SEGUROS GENERALES SURAMERICANA S.A.","99017000-2",null,null,"18.-Transporte Marítimo",{"$f":"+COUNTIF('Siniestros Denunciados'!$A$8:$A$70,Base!O19)","v":0},{"$f":"+COUNTIF('Siniestros Liquidación directa'!$A$9:$A$72,Base!O19)","v":0},{"$f":"+COUNTIF('Denunciados Periodos Anteriores'!$A$9:$A$70,Base!O19)","v":0}]
[null,null,null,null,null,1,"General","20.-Equipo Contratista",null,1,"SOUTHBRIDGE COMPAÑIA DE SEGUROS GENERALES S.A.","99288000-7",null,null,"19.-Transporte Aéreo",{"$f":"+COUNTIF('Siniestros Denunciados'!$A$8:$A$70,Base!O20)","v":0},{"$f":"+COUNTIF('Siniestros Liquidación directa'!$A$9:$A$72,Base!O20)","v":0},{"$f":"+COUNTIF('Denunciados Periodos Anteriores'!$A$9:$A$70,Base!O20)","v":0}]
{"$rows_left_out":70}